{"text_format":"1","workbook":"xlsx","n_sheets":11,"sheets":["ficheService","menu","statuts","intervenants","responsabilites","semestre1","semestre2","semestre3","semestre4","lp","ppnDUT"],"not_rendered":{"charts":0,"images":5,"macros":1,"external_links":0,"defined_names":2,"comments":0,"pivot_tables":0},"unopened":[],"bounds":{"document_bytes":16777216,"sheet_cells":100000,"rows_first":2000,"rows_last":500,"rows_between":2000,"halvings":0,"cell_chars":16384,"cell_head_chars":4096},"cells_cut":0,"cells_raw":0,"read":"whole","date_system":"1900"}

{"sheet":"ficheService","index":0,"n_rows":45,"n_cols":8,"rows_kept":45,"cut":false,"hidden":false,"merged":[[42,4,42,6],[44,5,45,7],[41,4,41,6],[14,6,15,7]]}
[]
[null,null,null,null,"Université de Poitiers"]
[null,null,null,null,"                   Fiche de service d'enseignement"]
[null,null,null,null,{"$f":"                   IF(MONTH(TODAY())>=7,\"Année universitaire \"&YEAR(TODAY())&\"-\"&YEAR(TODAY())+1,\"Année universitaire \"&YEAR(TODAY())-1 & \"-\"&YEAR(TODAY()))","v":"Année universitaire 2020-2021"}]
[]
[]
[]
[]
[null,null,null,null,"Intervenant STID Niort "]
[]
[]
[]
[]
[]
[null,null,null,null,"Statut :","PRAG",{"$f":"VLOOKUP(F15,statuts!A1:C7,2)","v":"Professeur Agrégé"}]
[null,null,null,null,"Nb Heures :",{"$f":"VLOOKUP(F15,statuts!A2:C7,3)","v":384}]
[]
[null,null,"Formation","UE","Module","CM","TD","TP"]
[null,null,"DUT STID","UE11","M1101A-Accueil Informatique",0,10,0]
[null,null,"DUT STID","UE13","M1301-Bases de la programmation",12,28,0]
[null,null,"DUT STID","UE13","M1302-Exploitation de données",9,28,0]
[null,null,"DUT STID","UE13","M1303-Outils de pilotage 1 - VBA Projet",0,18,0]
[null,null,"DUT STID","UE22","M2201-Développement logiciel et technologies web",12,28,0]
[null,null,"DUT STID","UE22","M2202-Structuration des données",5,14,0]
[null,null,"DUT STID","UE24","M2402-Projet 1",0,7,0]
[null,null,"DUT STID","UE34","M3403-Programmation statistique 2 - Python",0,14,0]
[null,null,"DUT STID","UE34","M3404-Projet 2",0,5,0]
[null,null,"DUT STID","UE41","M4103C-Fondamentaux de la programmation objet - JAVA",0,28,0]
[null,null,"DUT STID","UE43","M4301-Projet 3",0,5,0]
[null,null,"LP MDS","UE1","M14 - Techniques de programmation",0,25,0]
[null,null,"LP MDS","UE4","M43 - Connaissance Client",0,10,0]
[]
[]
[]
[]
[]
[]
[null,null,null,"Code","Responsabilité","eq.TD"]
[null,null,null,"DIR EDT",{"$f":"IF(D39=\"\",\"\",VLOOKUP(ficheService!D39,responsabilites!A3:C13,2,0))","v":"Direction des études du DUT STID - EDT & Services"},{"$f":"IF(D39=\"\",\"\",VLOOKUP(D39,responsabilites!A3:C13,3,0))","v":24}]
[null,null,null,"RLP",{"$f":"IF(D40=\"\",\"\",VLOOKUP(ficheService!D40,responsabilites!A3:C13,2,2))","v":"Responsable Licence Professionnelle"},{"$f":"IF(D40=\"\",\"\",VLOOKUP(ficheService!D40,responsabilites!A3:C13,3,2))","v":36}]
[]
[null,null,null,null,"Total Heures équivalent TD :",null,null,417]
[null,null,null,null,"Nombre d'heures complémentaires :",null,null,{"$f":"IF(H42-F16<0,0,H42-F16)","v":33}]
[]
[null,"Date et signature de l'enseignant"]

{"sheet":"menu","index":1,"n_rows":0,"n_cols":0,"rows_kept":0,"cut":false,"hidden":false,"merged":[]}

{"sheet":"statuts","index":2,"n_rows":7,"n_cols":3,"rows_kept":7,"cut":false,"hidden":false,"merged":[]}
["Statut","Signification","Nombre d'heures eq. TD à effectuer"]
["ATER","Attaché Temporaire d'Enseignement et de Recherche",192]
["EC","Enseignant chercheur",192]
["PRAG","Professeur Agrégé",384]
["PRCE","Professeur Certifié",384]
["VACET","Vacataire Enseignant Titulaire",192]
["VACIP","Vacataire Intervenant Professionnel",192]

{"sheet":"intervenants","index":3,"n_rows":40,"n_cols":12,"rows_kept":40,"cut":false,"hidden":false,"merged":[]}
["Enseignant","Statut","Spécialité","Responsabilité","Précision si VAC"]
["ABBOUD Stéphane","VACIP","Gestion de Projets",null,"IMA"]
["ALI Leïla","EC","Econométrie","PE 2"]
["ANCELOT Lydie","VACET","Econométrie",null,"EC IRIAF"]
["ARNAUD Jean-Philippe","VACET","Qualité",null,"PRAG Lycée Paul Guérin - NIORT"]
["ARNAUD Nadine","VACET","Economie-Gestion",null,"PRAG GEA",null,null,null,null,null,null,"Gestion de Projets"]
["AVRIL David","VACIP","Informatique Décisionnelle",null,"MAIF",null,null,null,null,null,null,"Econométrie"]
["BELLICAUD Clara","VACIP","Web Marketing",null,"MACIF",null,null,null,null,null,null,"Qualité"]
["BIEBER Hélène","PRCE","Expression et Communication","DIR SCO - COM",null,null,null,null,null,null,null,"Economie-Gestion"]
["BUREAU Laurent","PRAG","Mathématiques","CD",null,null,null,null,null,null,null,"Informatique Décisionnelle"]
["CANHA Sonia","VACIP","Marketing",null,"UMANIS - TOURS",null,null,null,null,null,null,"Web Marketing"]
["CANONNE Sylvia","PRAG","Anglais","RI E",null,null,null,null,null,null,null,"Expression et Communication"]
["CLEMENTE Cynthia","VACIP","Informatique Décisionnelle",null,"MICROPOLE (ESN) - NIORT",null,null,null,null,null,null,"Mathématiques"]
["DEDIEU Patrice","VACIP","Informatique Décisionnelle",null,"Conseil Départemental des Deux-Sèvres",null,null,null,null,null,null,"Marketing"]
["DOUGNAC Philippe","VACET","Economie-Gestion",null,"PRCE Lycée Jean Macé - NIORT",null,null,null,null,null,null,"Anglais"]
["GARNIER François","PRAG","Informatique","DIR EDT - RLP",null,null,null,null,null,null,null,"Informatique"]
["GIRARD Alexandre","VACIP","Informatique",null,"MACIF",null,null,null,null,null,null,"Système d'information Géographique"]
["GOUY Jeanne","VACET","Economie-Gestion",null,"PRCE Lycée Venise Verte - NIORT",null,null,null,null,null,null,"Droit"]
["GRANDJEAN Anthony","VACIP","Système d'information Géographique",null,"MAIF",null,null,null,null,null,null,"Statistique"]
["GREGOIRE Frédéric","VACIP","Droit",null,"DIRECCTE",null,null,null,null,null,null,"Physique-Chimie-Mathématiques"]
["IBAZIZEN Mohamed","EC","Statistique","PE 1",null,null,null,null,null,null,null,"Sondages"]
["JACQUES Audrey","VACIP","Informatique Décisionnelle",null,"MAIF",null,null,null,null,null,null,"Base de données"]
["JEAN DIT BERTHELOT Pascale","VACIP","Informatique",null,"GROUPAMA - NIORT"]
["JEU-HERAULT Mickaël","VACET","Physique-Chimie-Mathématiques",null,"PRCE Lycée Haut Val de Sèvre - ST MAIXENT"]
["JOURDAN Laurent","VACIP","Marketing",null,"MACIF"]
["MAHE Tiffanie","VACIP","Statistique",null,"MAAF"]
["MARCHESE Mickaël","VACIP","Informatique Décisionnelle",null,"KEREON"]
["MESMOUDI Amin","EC","Informatique","RI L"]
["MOREAU Philippe","VACIP","Marketing",null,"MAAF"]
["OMNES Gaël","VACIP","Marketing",null,"NIELSEN CONSULTING - PARIS"]
["PIQUET PELLORCE Xavier","VACIP","Informatique",null,"B&D - MAIF"]
["PROU Guillaume","VACIP","Sondages",null,"MAIF"]
["QANNARI Abdellah","EC","Statistique"]
["QUINTARD Annie","PRAG","Economie-Gestion","STA - PT"]
["REUILLON Cyril","VACIP","Informatique Décisionnelle",null,"GROUPAMA - NIORT"]
["RICHARD Maxime","VACIP","Statistique",null,"MAIF"]
["THEZARD Christophe","VACIP","Informatique Décisionnelle",null,"MAIF"]
["TRICOCHE Michel","VACIP","Base de données",null,"Hôpital de Niort"]
["VICIEN Guillaume","VACIP","Informatique Décisionnelle",null,"IMA"]
["VILATTE Jérémy","VACIP","Informatique Décisionnelle",null,"MAIF"]

{"sheet":"responsabilites","index":4,"n_rows":12,"n_cols":3,"rows_kept":12,"cut":false,"hidden":false,"merged":[]}
["Code Responsabilité","Responsabilité","Nombre d'heures eq. TD à effectuer"]
["CD","Chef de département",85]
["DIR SCO","Direction des études du DUT STID - Scolarité",30]
["DIR EDT","Direction des études du DUT STID - EDT & Services",24]
["COM","Responsable Communication & PPP",14]
["PE 1","Responsable Poursuite d'études 1",8]
["PE 2","Responsable Poursuite d'études 2",4]
["PT","Responsable Projets Tuteurés",3]
["RI E","Responsable Relations Internationales - Entreprises",9]
["RI L","Responsable Relations Internationales - Labo",6]
["RLP","Responsable Licence Professionnelle",36]
["STA","Responsable Stages",12]

{"sheet":"semestre1","index":5,"n_rows":20,"n_cols":9,"rows_kept":20,"cut":false,"hidden":false,"merged":[]}
["Code UE","Code module ","Type Module ","Libellé matière","Option","Enseignant","CM","TD","TP"]
["UE11","M1101A","Informatique","Accueil Informatique",null,"F.Garnier",0,10,0]
["UE11","M1101A","Mathématiques","Accueil Mathématiques",null,"L.Bureau",0,10,0]
["UE11","M1102","Statistique","Statistique descriptive 1",null,"L.Ali",7,22,0]
["UE11","M1103","Projet","Projet Personnel et Professionnel 1",null,"H.Bieber",0,18,0]
["UE12","M1201","Statistique","Statistique descriptive 2",null,"L.Ali",7,20,0]
["UE12","M1202","Mathématiques","Probabilités et simulations 1",null,"L.Bureau",9,28,0]
["UE12","M1203","Statistique","Etudes statistiques et enquêtes",null,"A.Quintard",7,16,0]
["UE12","M1204","Mathématiques","Mathématiques pour les probabilités et la statistique",null,"L.Bureau",16,22,0]
["UE13","M1301","Informatique","Bases de la programmation",null,"F.Garnier",12,28,0]
["UE13","M1302","Informatique","Exploitation de données",null,"F.Garnier",9,28,0]
["UE13","M1303","Economie-Gestion","Outils de pilotage 1 - Gestion",null,"N.Arnaud",0,22,0]
["UE13","M1303","Informatique","Outils de pilotage 1 - VBA Projet",null,"F.Garnier",0,18,0]
["UE14","M1401","Economie-Gestion","Economie générale et connaissance de l'entreprise",null,"L.Ali",8,14,0]
["UE14","M1401","Economie-Gestion","Economie générale et connaissance de l'entreprise",null,"P.Dougnac",5,6,"PRAG"]
["UE14","M1402","Communication","Bases de la communication",null,"H.Bieber",0,12,14]
["UE14","M1403","Anglais","Initiation à l'anglais de spécialité",null,"S.Canonne",0,12,14]
[]
[null,null,null,"Nombre de groupes TD",2]
[null,null,null,"Nombre de groupes TP",4]

{"sheet":"semestre2","index":6,"n_rows":23,"n_cols":11,"rows_kept":23,"cut":false,"hidden":false,"merged":[[18,9,19,9]]}
["Code UE","Code module ","Type module ","Libellé matière","Option","Enseignant","CM","TD","TP"]
["UE21","M2101","Statistique","Initiation à la stat. inférentielle",null,"M.Ibazizen",14,28,0]
["UE21","M2102","Statistique","Ajustement de courbes et séries chronologiques",null,"M.Ibazizen",9,18,0]
["UE21","M2103","Mathématiques","Probabilités et simulations 2",null,"L.Bureau",12,28,0]
["UE21","M2104","Mathématiques","Mathématiques pour l’analyse des données",null,"L.Bureau",18,28,8]
["UE22","M2201","Informatique","Développement logiciel et technologies web",null,"F.Garnier",12,28,0]
["UE22","M2202","Informatique","Structuration des données",null,"M.Tricoche",0,12,0]
["UE22","M2202","Informatique","Structuration des données",null,"F.Garnier",5,14,0]
["UE22","M2203","Informatique","Programmation statistique 1 - SAS",null,"A.Jacques",0,24,0]
["UE22","M2204","Economie-Gestion","Outils de pilotage 2",null,"A.Quintard",0,22,0]
["UE22","M2204","Informatique","Outils de pilotage 2 - Tableau Software",null,"M.Marchese",0,10,0]
["UE23","M2301","Economie-Gestion","Economie générale et management des org.",null,"J.Gouy",5,6,0]
["UE23","M2301","Economie-Gestion","Economie générale et management des org.",null,"P.Dougnac",5,6,0]
["UE23","M2301","Economie-Gestion","Economie générale et management des org.",null,"A.Quintard",7,8,0]
["UE23","M2302","Communication","Communication, information et argumentation",null,"H.Bieber",0,12,14]
["UE23","M2303","Anglais","Approf. Anglais de spécialité",null,"S.Canonne",0,12,14]
["UE23","M2304","Projet","Projet Personnel et Professionnel 2",null,"H.Bieber",0,18,0]
["UE24","M2401","Projet","Conduite de projets",null,"S.Abboud",0,10,0]
["UE24","M2402","Projet","Projet 1",null,"L.Ali - A.Quintard",0,7,0,"Explication : 14h car 0,5h/ étudiant\nCette année 56 étudiants en stid1","15 h etudiant"]
["UE24","M2402","Projet","Projet 1",null,"A.Mesmoudi - F.Garnier",0,7,0,null,"35 h etudiant"]
[]
[null,null,null,"Nombre de groupes TD",2]
[null,null,null,"Nombre de groupes TP",4]

{"sheet":"semestre3","index":7,"n_rows":25,"n_cols":11,"rows_kept":25,"cut":false,"hidden":false,"merged":[]}
["Code UE","Code module ","Type Module","Libellé matière","Option","Enseignant","CM","TD","TP"]
["UE31","M3101","Statistique","Analyse des données",null,"A.Qannari",14,26,0]
["UE31","M3102","Statistique","Estimation et tests d'hypothèse",null,"M.Ibazizen",14,22,0]
["UE31","M3103","Statistique","Modèle linéaire",null,"A.Qannari",14,26,0]
["UE32","M3201C","Informatique","Système d'information décisionnel",null,"A.Mesmoudi",0,10,0]
["UE32","M3201C","Informatique","Système d'information décisionnel - BO",null,"J.Vilatte",null,12]
["UE32","M3201C","Informatique","Système d'information décisionnel - Talend",null,"G.Vicien",0,12,0]
["UE32","M3202","Informatique","Développement d'applications décisionnelles",null,"A.Mesmoudi",0,28,0]
["UE32","M3203","Economie-Gestion","Techniques de gestion pour la décision",null,"A.Quintard",0,21,0]
["UE33","M3301","Economie-Gestion","Economie",null,"A.Quintard",9,18,0]
["UE33","M3302","Communication","Communication professionnelle",null,"H.Bieber",0,12,14]
["UE33","M3303","Anglais","Anglais professionnel et coopération internationale",null,"S.Canonne",0,25,14]
["UE33","M3304","Projet","Projet Personnel et Professionnel 3",null,"H.Bieber",0,18,0]
["UE34","M3401C","Mathématiques","Compléments d'analyse","PEL","L.Bureau",0,28,0]
["UE34","M3401C","Informatique","Etude de cas en statistique et informatique décisionnelle","IPI","A.Mesmoudi",0,28,0]
["UE34","M3402C","Economie-Gestion","Domaines d'application 1","IPI","A.Quintard",0,14,0]
["UE34","M3402C","Informatique","Domaines d'application 1 - WebMarketing","IPI","C.Bellicaud",0,14,0]
["UE34","M3402C","Economie-Gestion","Compléments de Gestion","PEL","A.Quintard",0,14,0]
["UE34","M3402C","Economie-Gestion","Econométrie","PEL","L.Ali",0,14,0]
["UE34","M3403","Statistique","Programmation statistique 2 - SAS",null,"A.Qannari",0,14,0]
["UE34","M3403","Informatique","Programmation statistique 2 - Python",null,"F.Garnier",0,14,0]
["UE34","M3404","Projet","Projet 2",null,"A.Mesmoudi - F.Garnier\nM.Ibazizen - A.Qannari\nA.Quintard - H.Bieber\nL.Bureau - S.Canonne",0,5,0,"40 h  : 1h / etud sur S3 S4","17,5 h etudiant"]
[]
[null,null,null,"Nombre de groupes TD",2]
[null,null,null,"Nombre de groupes TP",3]

{"sheet":"semestre4","index":8,"n_rows":24,"n_cols":11,"rows_kept":24,"cut":false,"hidden":false,"merged":[]}
["Code UE","Code module ","Type Module","Libellé matière","Option","Enseignant","CM","TD","TP"]
["UE41","M4101","Informatique","DataMining",null,"A.Mesmoudi",0,20,0]
["UE41","M4101","Statistique","DataMining",null,"A.Qannari",2,20,0]
["UE41","M4102C","Statistique","Tests non paramétriques",null,"L.Ancelot",6,8,0]
["UE41","M4102C","Statistique","Estimation et tests d'hypothèse - Compléments","PEL","M.Ibazizen",0,18,0]
["UE41","M4102C","Statistique","Sondages","IPI","G.Prou - M.Jeu-Herault",7,14,0]
["UE41","M4103C","Informatique","Bases de données avancées","IPI","A.Mesmoudi",0,28,0]
["UE41","M4103C","Informatique","Fondamentaux de la programmation objet - JAVA","PEL","F.Garnier",0,28,0]
["UE42","M4201C","Economie-Gestion","Economie, gestion","IPI","A.Quintard",0,28,0]
["UE42","M4201C","Economie-Gestion","Economie, gestion","PEL","A.Quintard",0,28,0]
["UE42","M4201C","Economie-Gestion","Droit","IPI","H.Bieber",0,14,0]
["UE42","M4201C","Economie-Gestion","Repères juridiques","PEL","H.Bieber",0,14,0]
["UE42","M4202","Communication","Communication dans les organisations",null,"H.Bieber",0,12,14]
["UE42","M4203","Anglais","Anglais scientifique",null,"S.Canonne",0,20,14]
["UE42","M4204","Economie-Gestion","Domaines d'application 2 - Qualité","IPI","J.Arnaud",0,14,0]
["UE42","M4204","Informatique","Domaines d'application 2 - SIG","IPI","A.Grandjean",0,14,0]
["UE42","M4204","Mathématiques","Domaines d'application 2 - Compléments d'algèbre","PEL","L.Bureau",0,14,0]
["UE42","M4204","Informatique","Domaines d'application 2 - Programmation Statistique avancée","PEL","A.Mesmoudi",0,18,0]
["UE43","M4301","Projet","Projet 3",null,"A.Mesmoudi - F.Garnier\nM.Ibazizen - A.Qannari\nA.Quintard - H.Bieber\nL.Bureau - S.Canonne",0,5,0,"40 h  : 1h / etud sur S3 S4","16 h etudiant"]
["UE43","M4302","Stage","Stage - application",null,null,0,0,0]
["UE43","M4302","Stage","Stage - restitution",null,null,0,0,0]
[]
[null,null,null,"Nombre de groupes TD",2]
[null,null,null,"Nombre de groupes TP",3]

{"sheet":"lp","index":9,"n_rows":34,"n_cols":6,"rows_kept":34,"cut":false,"hidden":false,"merged":[]}
["Code UE","Code module ","Type module ","Libellé matière","Enseignant","Nb Heures"]
["UE1 - Informatique Décisionnelle","M11 - Prépation des données","Informatique","Architecture d'un SID","C.Clemente",8]
["UE1 - Informatique Décisionnelle","M11 - Prépation des données","Informatique","Talend","P.Dedieu",14]
["UE1 - Informatique Décisionnelle","M11 - Prépation des données","Informatique","Fiabilisation des données","M.Richard",6]
["UE1 - Informatique Décisionnelle","M12 - Interrogation des données","Informatique","BDR/SQL","A.Girard",20]
["UE1 - Informatique Décisionnelle","M12 - Interrogation des données","Informatique","Big Data","A.Mesmoudi",20]
["UE1 - Informatique Décisionnelle","M13 - Tableau de Bord et Dataviz","Informatique","QlikView","C.Reuillon",15]
["UE1 - Informatique Décisionnelle","M13 - Tableau de Bord et Dataviz","Informatique","BO","D.Avril",20]
["UE1 - Informatique Décisionnelle","M13 - Tableau de Bord et Dataviz","Informatique","Dataviz","C.Thezard",10]
["UE1 - Informatique Décisionnelle","M14 - Techniques de programmation","Informatique","VBA","F.Garnier",25]
["UE1 - Informatique Décisionnelle","M14 - Techniques de programmation","Informatique","ORACLE PL/SQL","M.Tricoche",10]
["UE2 - Statistique","M21 - Programmation statistique","Statistique","SAS","A.Qannari",25]
["UE2 - Statistique","M21 - Programmation statistique","Statistique","R","L.Bureau",10]
["UE2 - Statistique","M22 - Statistique Descriptive et inférentielle","Statistique","Statistique Descriptive Excel","L.Bureau",15]
["UE2 - Statistique","M22 - Statistique Descriptive et inférentielle","Statistique","Statistique Inférentielle","M.Ibazizen",15]
["UE2 - Statistique","M23 - Statistique multidimensionnelle et Analyse des données","Statistique","ACP/AFC/AFCM","A.Qannari",15]
["UE2 - Statistique","M23 - Statistique multidimensionnelle et Analyse des données","Statistique","RLS, RLM, Anova","M.Ibazizen",15]
["UE3 - Environnement Professionnel","M31 - Techniques d'expression","Communication","Expression & Communication","H.Bieber",20]
["UE3 - Environnement Professionnel","M32 - Anglais Professionnel","Anglais","Anglais","S.Canonne",20]
["UE3 - Environnement Professionnel","M33 - Droit et Informatique","Droit","Droit et Informatique","F.Gregoire",20]
["UE4 - Application au Marketing","M41 - Marketing","Marketing","Techniques Marketing","L.Jourdan",20]
["UE4 - Application au Marketing","M41 - Marketing","Marketing","Web Marketing","P.Moreau",2]
["UE4 - Application au Marketing","M41 - Marketing","Informatique","GéoMarketing","A.Grandjean",10]
["UE4 - Application au Marketing","M42 - Etude de marché et enquête","Economie-Gestion","Etude de marché","A.Quintard",20]
["UE4 - Application au Marketing","M42 - Etude de marché et enquête","Marketing","Etude en grande consommation","G.Omnes",10]
["UE4 - Application au Marketing","M43 - Connaissance Client","Marketing","CRM","S.Canha",3]
["UE4 - Application au Marketing","M43 - Connaissance Client","Informatique","ERP ODOO","F.Garnier",10]
["UE4 - Application au Marketing","M43 - Connaissance Client","Informatique","Etude des données sociales","X.PiquetPellorce",12]
["UE4 - Application au Marketing","M43 - Connaissance Client","Statistique","Scoring","T.Mahé",10]
["UE4 - Application au Marketing","M44 - Etude de cas","Informatique","Etude de cas Excel SAS VBA QlikView","P.JeanDitBerthelot",10]
[]
[]
[]
[" "]

{"sheet":"ppnDUT","index":10,"n_rows":54,"n_cols":8,"rows_kept":54,"cut":false,"hidden":false,"merged":[]}
["Code UE","Code module ","Libellé module","CM","TD","TP"]
["UE11","M1101A","Accueil Mathématiques",10,15,5]
["UE11","M1101A","Accueil Informatique",10,15,5]
["UE11","M1102","Statistique descriptive 1",10,15,5]
["UE11","M1103","Projet Personnel et Professionnel 1",0,20,0]
["UE12","M1201","Statistique descriptive 2",10,15,5]
["UE12","M1202","Probabilités et simulations 1",10,20,10]
["UE12","M1203","Etudes statistiques et enquêtes",5,10,15]
["UE12","M1204","Mathématiques pour les probabilités et la statistique",20,15,10]
["UE13","M1301","Bases de la programmation",15,15,15]
["UE13","M1302","Exploitation de données",10,15,15]
["UE13","M1303","Outils de pilotage 1",15,15,15]
["UE14","M1401","Economie générale et connaissance de l'entreprise",15,20,0]
["UE14","M1402","Bases de la communication",0,15,15]
["UE14","M1403","Initiation à l'anglais de spécialité",0,15,15]
["UE21","M2101","Initiation à la stat. inférentielle",15,20,10]
["UE21","M2102","Ajustement de courbes et séries chronologiques",10,10,10]
["UE21","M2103","Probabilités et simulations 2",15,20,10]
["UE21","M2104","Mathématiques pour l’analyse des données",20,30,10]
["UE22","M2201","Développement logiciel et technologies web",15,15,15]
["UE22","M2202","Structuration des données",10,15,5]
["UE22","M2203","Programmation statistique 1",0,20,10]
["UE22","M2204","Outils de pilotage 2",10,10,10]
["UE23","M2301","Economie générale et management des org.",20,25,0]
["UE23","M2302","Communication, information et argumentation",0,15,15]
["UE23","M2303","Approf. Anglais de spécialité",0,15,15]
["UE23","M2304","Projet Personnel et Professionnel 2",0,20,0]
["UE24","M2401","Conduite de projets",5,15,0]
["UE24","M2402","Projet 1",0,120,0,"120h"]
["UE31","M3101","Analyse des données",15,20,10]
["UE31","M3102","Estimation et tests d'hypothèse",15,15,10]
["UE31","M3103","Modèle linéaire",15,15,15]
["UE32","M3201C","Système d'information décisionnel",5,20,20]
["UE32","M3202","Développement d'applications décisionnelles",5,15,10]
["UE32","M3203","Techniques de gestion pour la décision",10,15,5]
["UE33","M3301","Economie",10,20,0]
["UE33","M3302","Communication professionnelle",0,15,15]
["UE33","M3303","Anglais professionnel et coopération internationale",0,25,20]
["UE33","M3304","Projet Personnel et Professionnel 3",0,20,0]
["UE34","M3401C","Etude de cas en statistique et informatique décisionnelle",0,15,15]
["UE34","M3402C","Domaines d'application 1",5,10,15]
["UE34","M3403","Programmation statistique 2",5,10,15]
["UE34","M3404","Projet 2",0,90,0,"90h"]
["UE41","M4101","DataMining",10,25,10]
["UE41","M4102C","Sondages",10,20,5]
["UE41","M4103C","Bases de données avancées",5,15,10]
["UE42","M4201C","Economie, gestion et droit",15,25,0]
["UE42","M4202","Communication dans les organisations",0,15,15]
["UE42","M4203","Anglais scientifique",0,25,20]
["UE42","M4204","Domaines d'application 2",5,15,15]
["UE43","M4301","Projet 3",0,90,0,"90h"]
["UE43","M4302","Stage - application",0,0,0]
["UE43","M4302","Stage - restitution",0,0,0]
[null,null,null,{"$f":"SUM(D2:D53)","v":380},{"$f":"SUM(E2:E53)","v":1105},{"$f":"SUM(F2:F53)","v":465},{"$f":"SUM(D54:F54)","v":1950},"heures étudiant"]